litti chokha recipe step by step with pictures

# # The function is expected to return an INTEGER_ARRAY.

Failed to execute 'setRequestHeader' on 'XMLHttpRequest': String contains non ISO-8859-1 code point, BUG! code ERESOLVE npm ERR!

gettwofactorauthenticationuserasync returns null. operator, SyntaxError: missing ) after argument list, RangeError: repeat count must be non-negative, TypeError: can't delete non-configurable array element, RangeError: argument is not a valid code point, Error: Permission denied to access property "x", SyntaxError: redeclaration of formal parameter "x", TypeError: Reduce of empty array with no initial value, SyntaxError: "x" is a reserved identifier, RangeError: repeat count must be less than infinity, Warning: unreachable code after return statement, SyntaxError: "use strict" not allowed in function with non-simple parameters, ReferenceError: assignment to undeclared variable "x", ReferenceError: reference to undefined property "x", SyntaxError: function statement requires a name, Enumerability and ownership of properties, Function shares a name with a pre-existing property. node:internal/crypto/hash:67 this[kHandle] = new _Hash(algorithm, xofLen); error:0308010C:digital envelope routines::unsupported, Error: error:0308010C:digital envelope routines::unsupported, npm ERR!

SyntaxError: test for equality (==) mistyped as assignment (=)? Maybe there is a typo in the function name? For more information, see about_Execution_Policies at https:/go.microsoft.com/fwlink/?LinkID=135170. How to know the suffix of size in lvcreate. is not a function, ?test:712 Uncaught TypeError: $ is not a function, app.js:2 Uncaught TypeError: $this.tagify is not a function, app.js:4 Uncaught TypeError: is not a function, function()() is not a function javascript, js Uncaught TypeError: Object() is not a function, main.js:18 Uncaught TypeError: $ is not a function, new:596 Uncaught TypeError: is not a function in js, node.js Uncaught TypeError: is not a function, index.html:33 Uncaught TypeError: is not a function javascript, jasmien Uncaught TypeError: is not a function, solution to Uncaught TypeError: $().is not a function, Uncaught TypeError: "$" is not a function, PLAYCANVAS Uncaught TypeError: this. Asking for help, clarification, or responding to other answers. An accessor cannot be declared in an ambient context. fireabase is in node_modules buit can't resolve, How do I resolve 'Null is not an object' error when evaluating RNRandomBytes.seed, Backbone Error: Uncaught TypeError: this.set is not a function.

Uncaught TypeError: func is not a function. _this.errors.push(error.response.data.error); Uncaught Error: spawn node C:\Users\Leonl\Desktop\rpi-nano-server\electron\express\server.js ENOENT electron, TypeError: table.fnFilter is not a function, react enzyme mount ReferenceError: is not defined, /home/raj/Desktop/webProjects/node-shop-api/node_modules/whatwg-url/dist/encoding.js:2 const utf8Encoder = new TextEncoder(); ^ ReferenceError: TextEncoder is not defined, Javascript shows me TypeError saying my variable is undefined, "./src/firebase.js Module not found: Can't resolve 'firebase' in 'C:\Users\annej\OneDrive\Desktop\mern\amazon-clone\src' ", The bundle config file included in this upload has an invalid configuration. The Javascript error TypeError: "x" is not a function occurs when there is an attempt to call a function on a value or object, which is not actually a function. escue in _configure': Unable to monitor directories for changes because iNotify max watches exceeded. This can either be due to a cycle or if the object depth is larger than the maximum allowed depth of 32. This is an error with npm itself. Cool, that's exactly what I'm looking for! Module not found: Error: Can't resolve 'buffer' in. is not a function angular, VM1373:1 Uncaught TypeError: $ is not a function, TypeError: this.function is not a function, Uncaught TypeError: Object() is not a function react on build, Uncaught TypeError: Object() is not a function "pinia", Uncaught TypeError: func is not a function, Uncaught TypeError: ErrorHandling is not a function, Uncaught TypeError: login is not a function, Uncaught TypeError: Object() is not a function react native, Uncaught TypeError: $ is not a function in jquery, Uncaught TypeError: $ is not a function laravel jqyert, vendor.js Uncaught TypeError: t is not a function, uncaught typeerror object() is not a function react native, uncaught typeerror value is not a function in javascript, Uncaught TypeError: "is not a function" -jquery, Uncaught TypeError: $().is not a function in angular, uncaught typeerror object is not a function, Uncaught TypeError: $().clcik is not a function, Uncaught TypeError: $().bootpag is not a function, Uncaught TypeError: $() is not a function}, Uncaught TypeError: $ is not a function in js function, Uncaught TypeError: define is not a function, uncaught error. Failed to load module script: Expected a JavaScript module script but the server responded with a MIME type of "text/html". Uncaught DOMException: Failed to execute 'btoa' on 'Window': The string to be encoded contains characters outside of the Latin1 range. ExpressionChangedAfterItHasBeenCheckedError: reactjs firebase nested arrays are not supported, TypeError: MiniCssExtractPlugin is not a constructor, Valid intents must be provided for the Client, TypeError: Cannot read property '$router' of null. Error [DISALLOWED_INTENTS]: Privileged intent provided is not enabled or whitelisted. Chart with ID '0' must be destroyed before the canvas can be reused. code throws TypeError: arr[0] is not a function: Because there isn't a semicolon at the end of arr[0], JavaScript treats the above code as equivalent to: If you write JavaScript without semicolons, be sure to use a linter to avoid mistakes like this! (Use `node --trace-deprecation ` to show where the warning was created), sh: generated/aesprim-browser.js: Permission denied, Property 'socket' does not exist on type 'Window & typeof globalThis'.

Property 'paginator' has no initializer and is not definitely assigned in the constructor. AngularFireDatabase no mais um observable?? CocoaPods could not find compatible versions for pod "ReactCommon/jscallinvoker", visual studio appsettings development json not nested appsettings.json, npm ERR! server material ui, Warning: Prop `className` did not match materialui, [Unhandled promise rejection: Error: Reference.update failed: First argument contains undefined in property 'orders.-MN6f-JxMnLS4qAmVfs0.info.other_phone'], constant expression contains invalid operations laravel. 'exceptionRenderer' => '\CrudJsonApi\Error\JsonApiExceptionRenderer', Google Maps JavaScript API error: InvalidKeyMapError, z-song laravel-admin unable load js fucntion untill use f5, Count number of nodes in each connected part of an undirected unweighted graph, Uncaught TypeError: e.target.next is not a function, _40 0 _55 null _65 0 _72 null react native fetch, TypeError: (intermediate value).addBooks is not a function in js, ERROR in ./node_modules/pretty-format/node_modules/ansi-regex/index.js Module build failed: Error: ENOENT: no such file or directory, how to use handlebars.registerhelper if null, domdocument::save() getting permission errors. Experimental support for decorators is a feature that is subject to change in a future release. This is a required option and must be explicitly set to `true` or `false`, Failed to load module script: Expected a JavaScript module script but the server responded with a MIME type of "text/html", using / for division is deprecated and will be removed in dart sass 2.0.0, [!] // TypeError: document.getElementByID is not a function, //Uncaught TypeError: myNewDog.name is not a function, //Dog { age: 11, color: 'black', dogName: 'Cassidy' }, //Uncaught TypeError: 2 is not a function, Warning: -file- is being assigned a //# sourceMappingURL, but already has one, TypeError: invalid Array.prototype.sort argument, Warning: 08/09 is not a legal ECMA-262 octal constant, SyntaxError: invalid regular expression flag "x", TypeError: X.prototype.y called on incompatible type, ReferenceError: can't access lexical declaration 'X' before initialization, TypeError: can't assign to property "x" on "y": not an object, RangeError: x can't be converted to BigInt because it isn't an integer, TypeError: can't convert BigInt to number, TypeError: can't define property "x": "obj" is not extensible, TypeError: property "x" is non-configurable and can't be deleted, TypeError: can't redefine non-configurable property "x", SyntaxError: applying the 'delete' operator to an unqualified name is deprecated, ReferenceError: deprecated caller or arguments usage, Warning: expression closures are deprecated, SyntaxError: "0"-prefixed octal literals and octal escape seq. The terminal process failed to launch: Path to shell executable vs code, missing expression after unary operator '--', Cast to ObjectId failed for value "t" at path "_id" for model "User", angularjs getting Error: [$rootScope:inprog] $digest already in progress when changed from Fetch to $http + $q, errors thrown inside asynchronous functions will act like uncaught errors, ERROR Error: Uncaught (in promise): NullInjectorError: R3InjectorError(AuthModule)[AuthService -> AuthService -> AngularFirestore -> InjectionToken. To learn more, see our tips on writing great answers. Got "15.4.0", Invalid plugin options for "gatsby-plugin-manifest": - "value" must contain at least one of [icon, icons], PayloadTooLargeError: request entity too large, (node:14800) DeprecationWarning: collection.ensureIndex is deprecated. Check the spelling of the name, or if a path was included, verify that the path is correct and try again.

You can fix this issue by using the bind() method to pass the proper reference: Uncaught means the error was not caught in a try-catch block . DataTables warning: table id=example-dt - Invalid JSON response. Jest failed to parse a file. DeprecationWarning: current URL string parser is deprecated, and will be removed in a future version. Got "14.16.0", he "slide" event cannot be bound because Hammer.JS is not loaded and no custom loader has been specified, Error: Element type is invalid: expected a string (for built-in components) or a class/function (for composite components) but got: undefined. Sign Up Today! A typographical error in a function call. Does Intel Inboard 386/PC work on XT clone systems? Missing script: "build" for firebase, google autocomplete not returning lat long, google places autocomplete empty latitude, node.js 8 has been deprecated. which will work with Array objects only. firebase functions. Composer detected issues in your platform: Your Composer dependencies require a PHP version ">= 7.3.0". Consider using ReferenceHandler.Preserve on JsonSerializerOptions to support cycles. Error: Node Sass version 5.0.0 is incompatible with ^4.0.0. Register to vote on and add code examples. Instead, compose them together to a single function. Parsing the URL string using the Legacy API, Could not read source map for f@google-cloud/storage/build/src/channel.js: ENOENT: no such file or directory. because neither type sufficiently overlaps with the other. npm ERR! These properties are valid: object { lessOptions?, additionalData?, sourceMap?, webpackImporter?, implementation? No index signature with a parameter of type 'string' was found on type '{ develop: string; staging: string; production: string; }'.ts(7053). Can a human colony be self-sustaining without sunlight using mushrooms? Multiple children were passed to with `href` of `/escritorio/opcion1` but only one child is supported. Self Invoking Function ($()) That Can Be Reused, script.js:15 Uncaught ReferenceError: d3 is not defined at script.js, reactjs typeError: Cannot read property 'offsetHeight' of null, {"statusCode":400,"error":"Bad Request","message":"Unexpected token o in JSON at position 1"}, "gatsby-node.js" threw an error while running the onCreateNode lifecycle: fmImagesToRelative is not a function, Google Web App Script Unknown Parameter Error on Load, jquery DevTools failed to load source map: Could not load content for. # The function accepts INTEGER_ARRAY grades as parameter. ./node_modules/axios/lib/axios.js Cannot find module: './helpers/Axios Error'. jQuery.Deferred exception: is not a function TypeError: TypeError: script.funmction() is not a function, uncaught (in promise) typeerror not a function, Uncaught (in promise) TypeError: where is not a function, uncaught typeerror $().typeahead is not a function, Uncaught (in promise) TypeError: function is not a function, typeerror: is not a function angular testing, Uncaught (in promise) TypeError: # is not a function, main.js:78 Uncaught TypeError: is not a function, setup.js:69 Uncaught TypeError: this.value is not a function, script.js?ver=5.9.2:1 Uncaught TypeError: $ is not a function, javascript error when value is not a function, javascript uncaught type is not a fuction, how to fix uncaught typeerror $ is not a function, function is a function but error says not a functiom, func is not a function TypeError: func is not a function, script.js:7 Uncaught (in promise) TypeError: * is not a function at *, node.js uncought type error is not a function, UnhandledPromiseRejectionWarning: TypeError: .on is not a function, (W119)jshint(W119), Module not found: Can't resolve 'react-chartjs-2'. InvalidCharacterError: Failed to execute 'atob' on 'Window': The string to be decoded is not correctly encoded. The expression after '&' in a pipeline element produced an object that was not valid. Please add a ScriptResourceMapping named jquery(case-sensitive). UnhandledPromiseRejectionWarning: MongoNotConnectedError: TypeError: this.jsonEnabled is not a function, Cannot call `JSON.parse` with item bound to `text` because null or undefined [1] is incompatible with string, GridStore is deprecated, and will be removed in a future version. mv fails with "No space left on device" when the destination has 31 GB of space remaining, Cannot handle OpenDirect push notification when iOS app is not launched. Unexpected end of JSON input while parsing near 'r\nComment: https://o', UnhandledPromiseRejectionWarning: Error: Node is either not clickable or not an HTMLElement, npm ERR! # Complete the 'gradingStudents' function below. That will permanently disable this message but you might encounter other issues. You are running 7.2.19. in C:\php\largon\laragon\www\medmazza-simple-master\vendor\composer\platform_check.php on line 24, it is missing from your system. node_modules/mongodb/lib/json.js:10 catch { } // eslint-disable-line, Uncaught SyntaxError: Unexpected token '& when passing array from ejs, ngrx angular Cannot add property 0, object is not extensible, Could not parse as expression: "1, "desc" DataTable, angularjs Uncaught ReferenceError: myFunction is not defined at HTMLInputElement.onkeyup, typeerror: can't mix strings and bytes in path components, unhandledpromiserejectionwarning listener, Cannot read properties of undefined (reading 'target), showDescriptionErrors(){ const descriptionForm = this.postForm.get('description'); if (descriptionForm?.touched && !descriptionForm.valid){ if (descriptionForm.errors.required){ return 'Description is required'; }, initialization failed for block pool registering (datanode uuid unassigned) service to exiting, appdata roaming npm react-native.ps1 cannot be loaded, Argumento do tipo 'string | null 'no atribuvel ao parmetro do tipo' string '. notsup Unsupported platform for fsevents@2.3.2: wanted {"os":"darwin","arch":"any"} (current: {"os":"linux","arch":"x64"}), react ReferenceError: regeneratorRuntime is not defined. Do you have a link or a name that I can use to google this functionality of the arrow? Error: Could not symlink include/node/common.gypi /usr/local/include/node is not writable. The data option must be a function. Cannot destructure property 'dialog' of 'window.require().remote' as it is undefined. errno 1, Error: open failed: EACCES (Permission denied) react native, error parsing error the keyword 'const' is reserved, how to check if selector exists or is present puppeteer, unexpected token (note that you need plugins to import files that are not javascript). did you add it to @ngmodule.entrycomponents? Save screenshot even when path doesn't exists? Maybe the object you are calling the method For example: Most modern JavaScript runtimes are good about formatting this error, so you know what expression you tried to call that isn't a function. WARNING: There was an error checking the latest version of pip.

cb() never called! ERESOLVE unable to resolve dependency tree npm ERR! Encountered two children with the same key, `undefined`. FailedToParse: Password must be URL Encoded for mongodb: Element implicitly has an 'any' type because expression of type 'string' can't be used to index type '{}'. ypeError: Cannot read properties of undefined (reading 'params'), Error: Cannot find module 'webpack/lib/node/NodeTemplatePlugin', redirect is not defined react/jsx-no-undef, Getting Error cannot read property split of null, reactdom.render is no longer supported in react 18, slick.min.js:1 Uncaught TypeError: Cannot read property 'add' of null, npx create-react-app v2 Error: EPERM: operation not permitted, mkdir 'C:\Users\Viktor' command not found: create-react-app. Refused to evaluate a string as JavaScript because 'unsafe-eval' is not an allowed source of script in the following Content Security Policy directive: "script-src 'self'". Provide a valid, navigable address as the href value jsx-a11y/anchor-is-valid. Set the 'experimentalDecorators' option in your 'tsconfig' or 'jsconfig' to remove this warning.ts(1219) angular, Reloading app events.js:292 throw er; // Unhandled 'error' event ^ Error: EMFILE: too many open files, watch, eslint error Parsing error: The keyword 'const' is reserved, Uncaught TypeError: Cannot read property 'addEventListener' of undefined, uncaught TypeError: Bootstrap's JavaScript requires jQuery. is not a function, (index):146 Uncaught TypeError: $ is not a function, 1 Uncaught TypeError: $ is not a function, main.js:353 Uncaught TypeError: is not a function, index.js:25 Uncaught TypeError: is not a function javascript, jquery php Uncaught TypeError: $ is not a function, Uncaught TypeError: $().htmlNumberSpinner is not a function, "jQuery.Deferred exception: $ is not a function TypeError: $ is not a function", "Uncaught TypeError: isFunction is not a function", (index):1122 Uncaught TypeError: $() is not a function, (index):148 Uncaught TypeError: $ is not a function, (index):2141 Uncaught TypeError: $ is not a function, (index):476 Uncaught TypeError"" is not a function, Uncaught TypeError: $().on is not a function at 3928.js?v=2174:6:11, Uncaught TypeError: $().steps is not a function at, Uncaught TypeError: a is not a function js, Uncaught TypeError: e() is not a function, Uncaught TypeError: jQuery is not a function jquery, Uncaught TypeError: jQuery().htm is not a function, Uncaught TypeError: myfunction is not a function, Uncaught TypeError:function is not a function, VM20748:1 Uncaught TypeError: $().error is not a function, react TypeError Component is not a function, type error is not a function javascript react, this is not a function but it is javascript, TypeError: Object() is not a function at, typeerror object is not a function react util function, Syntax Error: TypeError: is not a function, script.js:60 Uncaught TypeError: is not a function, react Uncaught TypeError: t is not a function, react Uncaught TypeError: t() is not a function, script.js:4 Uncaught TypeError: $ is not a function at script.js:4, Reason: TypeError: Object() is not a function, TypeError: this. value from a function, but the value is not actually a function.

is not a function angular, TypeError: this.callInitHooks is not a function, script.js?ver=6.0:3 Uncaught TypeError: $ is not a function, react uncaught exception: is not a function, Server Error TypeError: Object() is not a function, Uncaught TypeError: $().usPhoneFormat is not a function, Uncaught TypeError: $().pjax is not a function, Uncaught TypeError: $().mateHover is not a function, Uncaught TypeError: $().wickedpicker is not a function, Uncaught TypeError: jQuery() is not a function at HTMLDocument., uncaught typeerror object() is not a function angular 11, Uncaught TypeError: jQuery().mmenu is not a function at HTMLDocument., Uncaught TypeError: jQuery().on() is not a function at HTMLDocument. (main.js:349:5), Uncaught TypeError: $ is not a function at HTMLDocument.

Tags: No tags

litti chokha recipe step by step with picturesAdd a Comment

Shopping Basket